BDBM50365406 CHEMBL1956932
SMILES C[C@H]1CN(C[C@@H](C)O1)c1ccc(Nc2nc3ccc(NS(=O)(=O)C(C)(C)C)cc3o2)cc1
InChI Key InChIKey=UQFDONSOHCWLLV-IYBDPMFKSA-N
Data  1 IC50
  Tab Delimited (TSV)   2D SDfile   Computed 3D by Vconf -m prep SDfile
Find this compound or compounds like it in BindingDB:
Activity Spreadsheet -- Enzyme Inhibition Constant Data from BindingDB
Found 1 hit for monomerid = 50365406
TargetNeuropeptide Y receptor type 5(Mus musculus (Mouse))
Shionogi
Curated by ChEMBL
LigandPNGBDBM50365406(CHEMBL1956932)
Affinity DataIC50:  5.29E+3nM. Assay description: Antagonist activity at mouse neuropeptide Y5 receptor
In DepthDetails ArticlePubMed