BDBM50365407 CHEMBL1956933
SMILES CCS(=O)(=O)c1ccc2oc(NC3CCCCC3)nc2c1
InChI Key InChIKey=AGLLNFLYGDJDIO-UHFFFAOYSA-N
Data  1 IC50
  Tab Delimited (TSV)   2D SDfile   Computed 3D by Vconf -m prep SDfile
Find this compound or compounds like it in BindingDB:
Activity Spreadsheet -- Enzyme Inhibition Constant Data from BindingDB
Found 1 hit for monomerid = 50365407
TargetNeuropeptide Y receptor type 5(Mus musculus (Mouse))
Shionogi
Curated by ChEMBL
LigandPNGBDBM50365407(CHEMBL1956933)
Affinity DataIC50:  1.40E+3nM. Assay description: Antagonist activity at mouse neuropeptide Y5 receptor
In DepthDetails ArticlePubMed