BDBM50365420 CHEMBL1956844
SMILES CCS(=O)(=O)c1ccc2oc(Nc3cccc(c3)C(F)(F)F)nc2c1
InChI Key InChIKey=AKYMZPXRNMDMCI-UHFFFAOYSA-N
Data  1 IC50
  Tab Delimited (TSV)   2D SDfile   Computed 3D by Vconf -m prep SDfile
Find this compound or compounds like it in BindingDB:
Activity Spreadsheet -- Enzyme Inhibition Constant Data from BindingDB
Found 1 hit for monomerid = 50365420
TargetNeuropeptide Y receptor type 5(Mus musculus (Mouse))
Shionogi
Curated by ChEMBL
LigandPNGBDBM50365420(CHEMBL1956844)
Affinity DataIC50:  144nM. Assay description: Antagonist activity at mouse neuropeptide Y5 receptor
In DepthDetails ArticlePubMed