BDBM50365448 CHEMBL1957256
SMILES Clc1ccc(NC(=O)Cn2c(nc3ccccc23)-c2ccccn2)cc1
InChI Key InChIKey=CEWKQYJGFZQFHU-UHFFFAOYSA-N
Data  3 IC50
  Tab Delimited (TSV)   2D SDfile   Computed 3D by Vconf -m prep SDfile
Find this compound or compounds like it in BindingDB:
Activity Spreadsheet -- Enzyme Inhibition Constant Data from BindingDB
Found 3 hits for monomerid = 50365448
TargetInosine-5'-monophosphate dehydrogenase(Cryptosporidium parvum)
Brandeis University
Curated by ChEMBL
LigandPNGBDBM50365448(CHEMBL1957256)
Affinity DataIC50:  43nM. Assay description: Inhibition of recombinant Cryptosporidium parvum IMPDH expressed in Escherichia coli assessed as NADH production preincubated for 5 mins by fluoresce...
In DepthDetails ArticlePubMed
TargetInosine-5'-monophosphate dehydrogenase 2(Homo sapiens (Human))
Brandeis University
Curated by ChEMBL
LigandPNGBDBM50365448(CHEMBL1957256)
Affinity DataIC50: >5.00E+3nM. Assay description: Inhibition of human IMPDH2
In DepthDetails ArticlePubMed
TargetInosine-5'-monophosphate dehydrogenase(Cryptosporidium parvum)
Brandeis University
Curated by ChEMBL
LigandPNGBDBM50365448(CHEMBL1957256)
Affinity DataIC50:  90nM. Assay description: Inhibition of recombinant Cryptosporidium parvum IMPDH expressed in Escherichia coli assessed as NADH production preincubated for 5 mins by fluoresce...
In DepthDetails ArticlePubMed