BDBM50365810 CHEMBL1956987
SMILES CC(C)N1CCC[C@H](Cn2c(C)nc3ncc(Oc4ccc(cc4)-c4ccccc4)cc3c2=O)C1
InChI Key InChIKey=LPTYIMZUXVDQLL-QFIPXVFZSA-N
Data  1 KI
  Tab Delimited (TSV)   2D SDfile   Computed 3D by Vconf -m prep SDfile
Find this compound or compounds like it in BindingDB:
Activity Spreadsheet -- Enzyme Inhibition Constant Data from BindingDB
Found 1 hit for monomerid = 50365810
TargetGrowth hormone secretagogue receptor type 1(Homo sapiens (Human))
Prosidion
Curated by ChEMBL
LigandPNGBDBM50365810(CHEMBL1956987)
Affinity DataKi:  1.70nM. Assay description: Displacement of [125I]-Ghrelin from human GHSR membranes overexpressing GSH-R1a by scintillation counting
In DepthDetails ArticlePubMed