BDBM50366072 CHEMBL1956746
SMILES CC(=O)OC[C@H]1O[C@@H](NC(=S)NNC(=O)c2ccc(cc2)S(N)(=O)=O)[C@H](OC(C)=O)[C@@H](OC(C)=O)[C@@H]1OC(C)=O
InChI Key InChIKey=LZSNZHCGBZCKRL-GQUPQBGVSA-N
Data  5 KI
  Tab Delimited (TSV)   2D SDfile   Computed 3D by Vconf -m prep SDfile
Find this compound or compounds like it in BindingDB:
Activity Spreadsheet -- Enzyme Inhibition Constant Data from BindingDB
Found 5 hits for monomerid = 50366072
TargetCarbonic anhydrase 12(Homo sapiens (Human))
Griffith University
Curated by ChEMBL
LigandPNGBDBM50366072(CHEMBL1956746)
Affinity DataKi:  7.30nM. Assay description: Inhibition of human carbonic anhydrase 12 catalytic domain preincubated for 15 mins by stopped flow CO2 hydration assay
In DepthDetails ArticlePubMed
TargetCarbonic anhydrase 9(Homo sapiens (Human))
Griffith University
Curated by ChEMBL
LigandPNGBDBM50366072(CHEMBL1956746)
Affinity DataKi:  8.70nM. Assay description: Inhibition of human carbonic anhydrase 9 catalytic domain preincubated for 15 mins by stopped flow CO2 hydration assay
In DepthDetails ArticlePubMed
TargetCarbonic anhydrase 2(Homo sapiens (Human))
Griffith University
Curated by ChEMBL
LigandPNGBDBM50366072(CHEMBL1956746)
Affinity DataKi:  10nM. Assay description: Inhibition of human cloned carbonic anhydrase 2 preincubated for 15 mins by stopped flow CO2 hydration assay
In DepthDetails ArticlePubMed
TargetCarbonic anhydrase 14(Homo sapiens (Human))
Griffith University
Curated by ChEMBL
LigandPNGBDBM50366072(CHEMBL1956746)
Affinity DataKi:  10.3nM. Assay description: Inhibition of human full length cloned transmembrane carbonic anhydrase 14 preincubated for 15 mins by CO2 hydration stopped-flow assay
In DepthDetails ArticlePubMed
TargetCarbonic anhydrase 1(Homo sapiens (Human))
Griffith University
Curated by ChEMBL
LigandPNGBDBM50366072(CHEMBL1956746)
Affinity DataKi:  3.77E+3nM. Assay description: Inhibition of human cloned carbonic anhydrase 1 preincubated for 15 mins by stopped flow CO2 hydration assay
In DepthDetails ArticlePubMed