BDBM50366141 CHEMBL1957432
SMILES Cc1cccc(C[C@H](O)\C=C\[C@H]2CCC(=O)N2Cc2cccc(CC(O)=O)c2)c1
InChI Key InChIKey=PLTQLAIXNAHXJI-PCBIHFGQSA-N
Data  4 KI
  Tab Delimited (TSV)   2D SDfile   Computed 3D by Vconf -m prep SDfile
Find this compound or compounds like it in BindingDB:
Activity Spreadsheet -- Enzyme Inhibition Constant Data from BindingDB
Found 4 hits for monomerid = 50366141
TargetProstaglandin E2 receptor EP4 subtype(Mus musculus (Mouse))
Minase Research Institute
Curated by ChEMBL
LigandPNGBDBM50366141(CHEMBL1957432)
Affinity DataKi:  78nM. Assay description: Displacement of [3H]-PGE2 from mouse EP4 receptor expressed in CHO cells after 60 mins by scintillation counting
In DepthDetails ArticlePubMed
TargetProstaglandin E2 receptor EP2 subtype(Mus musculus (Mouse))
Minase Research Institute
Curated by ChEMBL
LigandPNGBDBM50366141(CHEMBL1957432)
Affinity DataKi: >1.00E+4nM. Assay description: Displacement of [3H]-PGE2 from mouse EP2 receptor expressed in CHO cells after 60 mins by scintillation counting
In DepthDetails ArticlePubMed
TargetProstaglandin E2 receptor EP1 subtype(Mus musculus (Mouse))
Minase Research Institute
Curated by ChEMBL
LigandPNGBDBM50366141(CHEMBL1957432)
Affinity DataKi: >1.00E+4nM. Assay description: Displacement of [3H]-PGE2 from mouse EP1 receptor expressed in CHO cells after 60 mins by scintillation counting
In DepthDetails ArticlePubMed
TargetProstaglandin E2 receptor EP3 subtype(Mus musculus (Mouse))
Minase Research Institute
Curated by ChEMBL
LigandPNGBDBM50366141(CHEMBL1957432)
Affinity DataKi: >1.00E+4nM. Assay description: Displacement of [3H]-PGE2 from mouse EP3 receptor expressed in CHO cells after 60 mins by scintillation counting
In DepthDetails ArticlePubMed