BDBM50366158 CHEMBL1957571
SMILES OC(=O)C[C@H](NC(=O)[C@H](CS)NC(=O)c1ccc(F)cc1)C(O)=O
InChI Key InChIKey=OOELBFKJLWQETI-UWVGGRQHSA-N
Data  2 IC50
  Tab Delimited (TSV)   2D SDfile   Computed 3D by Vconf -m prep SDfile
Find this compound or compounds like it in BindingDB:
Activity Spreadsheet -- Enzyme Inhibition Constant Data from BindingDB
Found 2 hits for monomerid = 50366158
TargetProstaglandin G/H synthase 2(Homo sapiens (Human))
University Of Alberta
Curated by ChEMBL
LigandPNGBDBM50366158(CHEMBL1957571)
Affinity DataIC50:  1.40E+4nM. Assay description: Inhibition of human recombinant COX2 by fluorescence assay
In DepthDetails ArticlePubMed
TargetProstaglandin G/H synthase 1(Ovis aries (Sheep))
University Of Alberta
Curated by ChEMBL
LigandPNGBDBM50366158(CHEMBL1957571)
Affinity DataIC50:  1.50E+4nM. Assay description: Inhibition of ovine COX1 by fluorescence assay
In DepthDetails ArticlePubMed