BDBM50366187 CHEMBL1957586
SMILES NC(=O)[C@@H]1CCC(=O)N1Cc1ccc(cc1)-c1ccccc1
InChI Key InChIKey=YQCQHFRCABEIDV-INIZCTEOSA-N
Data  1 IC50
  Tab Delimited (TSV)   2D SDfile   Computed 3D by Vconf -m prep SDfile
Find this compound or compounds like it in BindingDB:
Activity Spreadsheet -- Enzyme Inhibition Constant Data from BindingDB
Found 1 hit for monomerid = 50366187
Target72 kDa type IV collagenase(Homo sapiens (Human))
Colosseum Combinatorial Chemistry Centre For Technology (C4T Scarl)
Curated by ChEMBL
LigandPNGBDBM50366187(CHEMBL1957586)
Affinity DataIC50: >5.00E+5nM. Assay description: Inhibition of full length MMP2 using Mca-Pro-Leu-Gly-Leu-Dpa-Ala-Arg-NH2 as substrate preincubated for 1 hr prior substrate addition measured after 3...
In DepthDetails ArticlePubMed