BDBM50366328 CHEMBL606075
SMILES OCC1OC(CP(O)(=O)OP(O)(=O)OC[C@H]2OC([C@H](O)[C@@H]2O)n2ccc(=O)[nH]c2=O)=CC(O)C1O
InChI Key InChIKey=QPKXYGVIVBDPHQ-WEDSKWJTSA-N
Data  1 KI
  Tab Delimited (TSV)   2D SDfile   Computed 3D by Vconf -m prep SDfile
Find this compound or compounds like it in BindingDB:
Activity Spreadsheet -- Enzyme Inhibition Constant Data from BindingDB
Found 1 hit for monomerid = 50366328
TargetBeta-1,4-galactosyltransferase 1(Bos taurus (Cattle))
TBA
Curated by ChEMBL
LigandPNGBDBM50366328(CHEMBL606075)
Affinity DataKi:  6.20E+4nM. Assay description: Inhibition constant of compound was tested against Beta-galactosyltransferase from bovine milk
In DepthDetails Article