BDBM50366330 CHEMBL605663
SMILES O[C@@H]1[C@@H](COP(O)(=O)CP(O)(=O)OC2OC(O)C(O)C(O)C2O)OC([C@@H]1O)n1ccc(=O)[nH]c1=O
InChI Key InChIKey=YXDPDZXUCYFTSS-PAMMDAJRSA-N
Data  1 KI
  Tab Delimited (TSV)   2D SDfile   Computed 3D by Vconf -m prep SDfile
Find this compound or compounds like it in BindingDB:
Activity Spreadsheet -- Enzyme Inhibition Constant Data from BindingDB
Found 1 hit for monomerid = 50366330
TargetBeta-1,4-galactosyltransferase 1(Bos taurus (Cattle))
TBA
Curated by ChEMBL
LigandPNGBDBM50366330(CHEMBL605663)
Affinity DataKi:  9.69E+4nM. Assay description: Inhibition constant of compound was tested against Beta-galactosyltransferase from bovine milk
In DepthDetails Article