BDBM50366423 CHEMBL1791279
SMILES CC[C@@H](C)[C@H](NC(=O)[C@H](CC(O)=O)NC(=O)[C@H](CC(C)C)NC(=O)[C@@H](Cc1ccccc1)NC(C)=O)C(=O)N[C@@H]([C@@H](C)CC)C(=O)N[C@@H](Cc1c[nH]c2ccccc12)C(O)=O
InChI Key InChIKey=DHRNHNAPGPSYGB-JAMUSYCNSA-N
Data  2 IC50
  Tab Delimited (TSV)   2D SDfile   Computed 3D by Vconf -m prep SDfile
Find this compound or compounds like it in BindingDB:
Activity Spreadsheet -- Enzyme Inhibition Constant Data from BindingDB
Found 2 hits for monomerid = 50366423
TargetEndothelin-1 receptor(Homo sapiens (Human))
TBA
Curated by ChEMBL
LigandPNGBDBM50366423(CHEMBL1791279)
Affinity DataIC50:  1.80E+3nM. Assay description: Inhibition of [125I]endothelin-1 [ET-1] binding to endothelin A receptor (ETA) of rabbit renal artery vascular smooth muscle cells
In DepthDetails Article
TargetEndothelin receptor type B(RAT)
TBA
Curated by ChEMBL
LigandPNGBDBM50366423(CHEMBL1791279)
Affinity DataIC50:  2.00E+3nM. Assay description: Inhibition of [125I]-endothelin-3 [ET-3] binding to endothelin B receptor (ETB) of rat cerebellum
In DepthDetails Article