BDBM50366451 CHEMBL1907918
SMILES COC[C@H](COc1ccc(OCc2cccc(c2)C(F)(F)F)cc1C(C)=O)OC(=O)OC
InChI Key InChIKey=IADJXPUWYAVHDE-GOSISDBHSA-N
Data  1 IC50
  Tab Delimited (TSV)   2D SDfile   Computed 3D by Vconf -m prep SDfile
Find this compound or compounds like it in BindingDB:
Activity Spreadsheet -- Enzyme Inhibition Constant Data from BindingDB
Found 1 hit for monomerid = 50366451
TargetAmine oxidase [flavin-containing] B(Rattus norvegicus (rat))
TBA
Curated by ChEMBL
LigandPNGBDBM50366451(CHEMBL1907918)
Affinity DataIC50:  200nM. Assay description: In vitro inhibitory activity against monoamine oxidase B (MAO-B).
In DepthDetails Article