BDBM50366465 CHEMBL1790672
SMILES CC[C@H](C)[C@H](NC(=O)[C@@H]1CCCN1C[C@@H](O)[C@H]1Cc2ccc(OCCCC(=O)NC(CC(N)=O)C(=O)N1)cc2)C(=O)N[C@@H](C(C)C)C(N)=O
InChI Key InChIKey=NTXPPIBCRQQDJL-YNWVVALRSA-N
Data  1 KI
  Tab Delimited (TSV)   2D SDfile   Computed 3D by Vconf -m prep SDfile
Find this compound or compounds like it in BindingDB:
Activity Spreadsheet -- Enzyme Inhibition Constant Data from BindingDB
Found 1 hit for monomerid = 50366465
TargetGag-Pol polyprotein [489-587](Human immunodeficiency virus type 1)
TBA
Curated by ChEMBL
LigandPNGBDBM50366465(CHEMBL1790672)
Affinity DataKi:  470nM. Assay description: Inhibition of HIV-1 protease.
In DepthDetails Article