BDBM50366542 CHEMBL609525
SMILES CCNC(=O)[C@H]1OC([C@H](O)[C@@H]1O)n1cnc2c(NCCCCNS(=O)(=O)c3cccc4c(cccc34)N(C)C)ncnc12
InChI Key InChIKey=DXKGEFIRDVVGKW-HJMQJNHMSA-N
Data  3 KI
  Tab Delimited (TSV)   2D SDfile   Computed 3D by Vconf -m prep SDfile
Find this compound or compounds like it in BindingDB:
Activity Spreadsheet -- Enzyme Inhibition Constant Data from BindingDB
Found 3 hits for monomerid = 50366542
TargetAdenosine receptor A1(Rattus norvegicus (rat))
Glaxowellcome Medicines Research Center
Curated by ChEMBL
LigandPNGBDBM50366542(CHEMBL609525)
Affinity DataKi:  70nM. Assay description: Binding affinity for adenosine A1 receptor of rat cerebral cortex membrane using [3H]CHA
In DepthDetails ArticlePubMed
TargetAdenosine receptor A3(Rattus norvegicus)
Glaxowellcome Medicines Research Center
Curated by ChEMBL
LigandPNGBDBM50366542(CHEMBL609525)
Affinity DataKi:  2.00E+3nM. Assay description: Binding affinity for adenosine A3 receptor of rat testis membrane using [3H](R)-PIA
In DepthDetails ArticlePubMed
TargetAdenosine receptor A2a/A2b(Rattus norvegicus)
Glaxowellcome Medicines Research Center
Curated by ChEMBL
LigandPNGBDBM50366542(CHEMBL609525)
Affinity DataKi:  9.50E+3nM. Assay description: Binding affinity for adenosine A2 receptor of rat striatal membrane using [3H]CGS-21680
In DepthDetails ArticlePubMed