BDBM50366627 CHEMBL3144087::CHEMBL608223
SMILES OC[C@H]1O[C@@H](Cn2cnc3c(NC4CC5CC4C(=O)C5)ncnc23)[C@H](O)[C@@H]1O
InChI Key InChIKey=FHYVXHZVGNDRHK-LADFMAERSA-N
Data  1 EC50
  Tab Delimited (TSV)   2D SDfile   Computed 3D by Vconf -m prep SDfile
Find this compound or compounds like it in BindingDB:
Activity Spreadsheet -- Enzyme Inhibition Constant Data from BindingDB
Found 1 hit for monomerid = 50366627
TargetAdenosine receptor A1(Homo sapiens (Human))
Deakin University
Curated by ChEMBL
LigandPNGBDBM50366627(CHEMBL3144087 | CHEMBL608223)
Affinity DataEC50:  2.70nM. Assay description: Adenosine receptor agonistic activity against isoproterenol (1 uM) stimulated cAMP accumulation in DDT MF-2 cells
In DepthDetails ArticlePubMed