BDBM50366796 CHEMBL609440
SMILES COc1cc2cc(sc2cc1OC)C(=O)CCc1cc[n+](Cc2ccc(o2)[N+]([O-])=O)cc1
InChI Key InChIKey=PIUDKWKHYCTTMB-UHFFFAOYSA-N
Data  1 IC50  1 EC50
  Tab Delimited (TSV)   2D SDfile   Computed 3D by Vconf -m prep SDfile
Find this compound or compounds like it in BindingDB:
Activity Spreadsheet -- Enzyme Inhibition Constant Data from BindingDB
Found 2 hits for monomerid = 50366796
TargetAcetylcholinesterase(Homo sapiens (Human))
Organon Laboratories
Curated by ChEMBL
LigandPNGBDBM50366796(CHEMBL609440)
Affinity DataEC50:  2.67E+3nM. Assay description: In vitro reversal of vecuronium-induced block in isolated guinea pig hemi-diaphragm.
In DepthDetails ArticlePubMed
TargetAcetylcholinesterase(Homo sapiens (Human))
Organon Laboratories
Curated by ChEMBL
LigandPNGBDBM50366796(CHEMBL609440)
Affinity DataIC50:  4.5nM. Assay description: Concentration required for the inhibition of acetylcholinesterase
In DepthDetails ArticlePubMed