BDBM50366920 CHEMBL608046
SMILES Nc1nc2n(cnc2c(=O)[nH]1)C1O[C@H](COP(O)(=O)OP(O)(=O)OCc2cn(CCCC(=O)NC(Cc3ccccc3)c3ccccc3)nn2)[C@@H](O)[C@H]1O
InChI Key InChIKey=BPTYAJAIOKEOCT-HXFPNWOQSA-N
Data  1 KI  1 IC50
  Tab Delimited (TSV)   2D SDfile   Computed 3D by Vconf -m prep SDfile
Find this compound or compounds like it in BindingDB:
Activity Spreadsheet -- Enzyme Inhibition Constant Data from BindingDB
Found 2 hits for monomerid = 50366920
Target4-galactosyl-N-acetylglucosaminide 3-alpha-L-fucosyltransferase FUT6(Homo sapiens (Human))
The Scripps Research Institute
Curated by ChEMBL
LigandPNGBDBM50366920(CHEMBL608046)
Affinity DataKi:  1.07E+3nM. Assay description: Compound was tested for binding affinity against Fucosyltransferase 6
In DepthDetails ArticlePubMed
Target4-galactosyl-N-acetylglucosaminide 3-alpha-L-fucosyltransferase FUT6(Homo sapiens (Human))
The Scripps Research Institute
Curated by ChEMBL
LigandPNGBDBM50366920(CHEMBL608046)
Affinity DataIC50:  3.96E+3nM. Assay description: Inhibitory concentration required against Fucosyltransferase 6
In DepthDetails ArticlePubMed