BDBM50366993 CHEMBL603334
SMILES Nc1ncnc2n(C3O[C@H](COP(O)(O)=O)[C@@H](O)[C@H]3O)c(SCc3ccc(Cl)cc3)nc12
InChI Key InChIKey=MBIPRSASAQQMHG-AARXTDBFSA-N
Data  1 KI
  Tab Delimited (TSV)   2D SDfile   Computed 3D by Vconf -m prep SDfile
Find this compound or compounds like it in BindingDB:
Activity Spreadsheet -- Enzyme Inhibition Constant Data from BindingDB
Found 1 hit for monomerid = 50366993
TargetInosine-5'-monophosphate dehydrogenase(Escherichia coli (strain K12))
TBA
Curated by ChEMBL
LigandPNGBDBM50366993(CHEMBL603334)
Affinity DataKi:  5.30E+4nM. Assay description: Inhibition of inosine monophosphate dehydrogenase in Escherichia coli
In DepthDetails ArticlePubMed