BDBM50367021 CHEMBL605220
SMILES CCCCCSc1nc2c(N)ncnc2n1C1O[C@H](COP(O)(O)=O)[C@@H](O)[C@H]1O
InChI Key InChIKey=QMDINZFRFHLCFO-OYBGHCQBSA-N
Data  1 KI
  Tab Delimited (TSV)   2D SDfile   Computed 3D by Vconf -m prep SDfile
Find this compound or compounds like it in BindingDB:
Activity Spreadsheet -- Enzyme Inhibition Constant Data from BindingDB
Found 1 hit for monomerid = 50367021
TargetInosine-5'-monophosphate dehydrogenase(Escherichia coli (strain K12))
TBA
Curated by ChEMBL
LigandPNGBDBM50367021(CHEMBL605220)
Affinity DataKi:  8.40E+4nM. Assay description: Inhibition of inosine monophosphate dehydrogenase in Escherichia coli
In DepthDetails ArticlePubMed