BDBM50020240 1-[6-Fluoro-3-(4-fluoro-phenyl)-indan-1-yl]-4-methyl-piperazine::CHEMBL1204285::CHEMBL307717
SMILES CN1CCN(CC1)C1CC(c2ccc(F)cc12)c1ccc(F)cc1
InChI Key InChIKey=BOFPIRRSGDHUCZ-UHFFFAOYSA-N
Data  23 IC50
  Tab Delimited (TSV)   2D SDfile   Computed 3D by Vconf -m prep SDfile
Find this compound or compounds like it in BindingDB:
Activity Spreadsheet -- Enzyme Inhibition Constant Data from BindingDB
Found 23 hits for monomerid = 50020240
TargetSodium-dependent dopamine transporter(Rattus norvegicus (rat))
TBA
Curated by ChEMBL
LigandPNGBDBM50020240(1-[6-Fluoro-3-(4-fluoro-phenyl)-indan-1-yl]-4-meth...)
Affinity DataIC50:  110nM. Assay description: Effect on synaptosomal uptake inhibition of Dopamine transporter
In DepthDetails ArticlePubMed
TargetBeta-1/Beta-2/Beta-3 adrenergic receptor(Rattus norvegicus (Rat))
TBA
Curated by ChEMBL
LigandPNGBDBM50020240(1-[6-Fluoro-3-(4-fluoro-phenyl)-indan-1-yl]-4-meth...)
Affinity DataIC50:  45nM. Assay description: Effect on synaptosomal uptake inhibition of Noradrenaline (NA)
In DepthDetails ArticlePubMed
TargetD(1A) dopamine receptor(RAT)
H. Lundbeck
Curated by ChEMBL
LigandPNGBDBM50020240(1-[6-Fluoro-3-(4-fluoro-phenyl)-indan-1-yl]-4-meth...)
Affinity DataIC50:  2.80E+3nM. Assay description: Binding affinity for dopamine receptor D1, activity is expressed as IC50 values.
In DepthDetails ArticlePubMed
TargetD(2) dopamine receptor(Rattus norvegicus (rat))
H. Lundbeck
Curated by ChEMBL
LigandPNGBDBM50020240(1-[6-Fluoro-3-(4-fluoro-phenyl)-indan-1-yl]-4-meth...)
Affinity DataIC50:  91nM. Assay description: Binding affinity against dopamine receptor D2
In DepthDetails ArticlePubMed
TargetD(1A) dopamine receptor(RAT)
H. Lundbeck
Curated by ChEMBL
LigandPNGBDBM50020240(1-[6-Fluoro-3-(4-fluoro-phenyl)-indan-1-yl]-4-meth...)
Affinity DataIC50:  2.80E+3nM. Assay description: Binding affinity for dopamine receptor D1, activity is expressed as IC50 values.
In DepthDetails ArticlePubMed
TargetSodium-dependent serotonin transporter(Rattus norvegicus (rat))
TBA
Curated by ChEMBL
LigandPNGBDBM50020240(1-[6-Fluoro-3-(4-fluoro-phenyl)-indan-1-yl]-4-meth...)
Affinity DataIC50:  6.10E+3nM. Assay description: Effect on synaptosomal uptake inhibition of 5-hydroxytryptamine (5-HT)
In DepthDetails ArticlePubMed
TargetD(2) dopamine receptor(Rattus norvegicus (rat))
H. Lundbeck
Curated by ChEMBL
LigandPNGBDBM50020240(1-[6-Fluoro-3-(4-fluoro-phenyl)-indan-1-yl]-4-meth...)
Affinity DataIC50:  91nM. Assay description: Inhibition of [3H]spiperone binding to Dopamine receptor D2 from rat striatal membranes
In DepthDetails ArticlePubMed
TargetSerotonin 2 (5-HT2) receptor(RAT)
H. Lundbeck
Curated by ChEMBL
LigandPNGBDBM50020240(1-[6-Fluoro-3-(4-fluoro-phenyl)-indan-1-yl]-4-meth...)
Affinity DataIC50:  7.70nM. Assay description: Inhibition of [3H]spiperone binding to 5-hydroxytryptamine 2 receptor from rat cortical membranes
In DepthDetails ArticlePubMed
TargetAlpha-1A/Alpha-1B/Alpha-1D adrenergic receptor(Rattus norvegicus (rat))
H. Lundbeck
Curated by ChEMBL
LigandPNGBDBM50020240(1-[6-Fluoro-3-(4-fluoro-phenyl)-indan-1-yl]-4-meth...)
Affinity DataIC50:  22nM. Assay description: Inhibition of [3H]prazosin binding to alpha-1 adrenergic receptor from rat cortical membranes
In DepthDetails ArticlePubMed
TargetD(1A)/D(1B)/D(2)/D(3)/D(4) dopamine receptor(Rattus norvegicus (rat))
TBA
Curated by ChEMBL
LigandPNGBDBM50020240(1-[6-Fluoro-3-(4-fluoro-phenyl)-indan-1-yl]-4-meth...)
Affinity DataIC50:  57nM. Assay description: Ability to displace [3H]haloperidol from rat striatal membranes, in order to measure its intrinsic affinity for the dopamine (DA) receptor
In DepthDetails ArticlePubMed
TargetD(1A)/D(1B)/D(2)/D(3)/D(4) dopamine receptor(Rattus norvegicus (rat))
TBA
Curated by ChEMBL
LigandPNGBDBM50020240(1-[6-Fluoro-3-(4-fluoro-phenyl)-indan-1-yl]-4-meth...)
Affinity DataIC50:  2.50E+3nM. Assay description: Ability to displace [3H]haloperidol from rat striatal membranes, in order to measure its intrinsic affinity for the dopamine (DA) receptor
In DepthDetails ArticlePubMed
TargetD(1A)/D(1B)/D(2)/D(3)/D(4) dopamine receptor(Rattus norvegicus (rat))
TBA
Curated by ChEMBL
LigandPNGBDBM50020240(1-[6-Fluoro-3-(4-fluoro-phenyl)-indan-1-yl]-4-meth...)
Affinity DataIC50:  780nM. Assay description: Ability to displace [3H]haloperidol from rat striatal membranes, in order to measure its intrinsic affinity for the dopamine (DA) receptor
In DepthDetails ArticlePubMed
TargetD(1A)/D(1B)/D(2)/D(3)/D(4) dopamine receptor(Rattus norvegicus (rat))
TBA
Curated by ChEMBL
LigandPNGBDBM50020240(1-[6-Fluoro-3-(4-fluoro-phenyl)-indan-1-yl]-4-meth...)
Affinity DataIC50:  22nM. Assay description: Ability to displace [3H]haloperidol from rat striatal membranes, in order to measure its intrinsic affinity for the dopamine (DA) receptor
In DepthDetails ArticlePubMed
TargetSodium-dependent serotonin transporter(Rattus norvegicus (rat))
TBA
Curated by ChEMBL
LigandPNGBDBM50020240(1-[6-Fluoro-3-(4-fluoro-phenyl)-indan-1-yl]-4-meth...)
Affinity DataIC50:  630nM. Assay description: Effect on synaptosomal uptake inhibition of 5-hydroxytryptamine (5-HT)
In DepthDetails ArticlePubMed
TargetSodium-dependent serotonin transporter(Rattus norvegicus (rat))
TBA
Curated by ChEMBL
LigandPNGBDBM50020240(1-[6-Fluoro-3-(4-fluoro-phenyl)-indan-1-yl]-4-meth...)
Affinity DataIC50:  4.00E+3nM. Assay description: Effect on synaptosomal uptake inhibition of 5-hydroxytryptamine (5-HT)
In DepthDetails ArticlePubMed
TargetSodium-dependent serotonin transporter(Rattus norvegicus (rat))
TBA
Curated by ChEMBL
LigandPNGBDBM50020240(1-[6-Fluoro-3-(4-fluoro-phenyl)-indan-1-yl]-4-meth...)
Affinity DataIC50:  2.00E+3nM. Assay description: Effect on synaptosomal uptake inhibition of 5-hydroxytryptamine (5-HT)
In DepthDetails ArticlePubMed
TargetSodium-dependent dopamine transporter(Rattus norvegicus (rat))
TBA
Curated by ChEMBL
LigandPNGBDBM50020240(1-[6-Fluoro-3-(4-fluoro-phenyl)-indan-1-yl]-4-meth...)
Affinity DataIC50:  1.80E+3nM. Assay description: Effect on synaptosomal uptake inhibition of Dopamine transporter
In DepthDetails ArticlePubMed
TargetSodium-dependent dopamine transporter(Rattus norvegicus (rat))
TBA
Curated by ChEMBL
LigandPNGBDBM50020240(1-[6-Fluoro-3-(4-fluoro-phenyl)-indan-1-yl]-4-meth...)
Affinity DataIC50:  180nM. Assay description: Effect on synaptosomal uptake inhibition of Dopamine transporter
In DepthDetails ArticlePubMed
TargetSodium-dependent dopamine transporter(Rattus norvegicus (rat))
TBA
Curated by ChEMBL
LigandPNGBDBM50020240(1-[6-Fluoro-3-(4-fluoro-phenyl)-indan-1-yl]-4-meth...)
Affinity DataIC50:  88nM. Assay description: Effect on synaptosomal uptake inhibition of Dopamine transporter
In DepthDetails ArticlePubMed
TargetBeta-1/Beta-2/Beta-3 adrenergic receptor(Rattus norvegicus (Rat))
TBA
Curated by ChEMBL
LigandPNGBDBM50020240(1-[6-Fluoro-3-(4-fluoro-phenyl)-indan-1-yl]-4-meth...)
Affinity DataIC50:  1.30E+4nM. Assay description: Effect on synaptosomal uptake inhibition of Noradrenaline (NA)
In DepthDetails ArticlePubMed
TargetBeta-1/Beta-2/Beta-3 adrenergic receptor(Rattus norvegicus (Rat))
TBA
Curated by ChEMBL
LigandPNGBDBM50020240(1-[6-Fluoro-3-(4-fluoro-phenyl)-indan-1-yl]-4-meth...)
Affinity DataIC50:  97nM. Assay description: Effect on synaptosomal uptake inhibition of Noradrenaline (NA)
In DepthDetails ArticlePubMed
TargetBeta-1/Beta-2/Beta-3 adrenergic receptor(Rattus norvegicus (Rat))
TBA
Curated by ChEMBL
LigandPNGBDBM50020240(1-[6-Fluoro-3-(4-fluoro-phenyl)-indan-1-yl]-4-meth...)
Affinity DataIC50:  32nM. Assay description: Effect on synaptosomal uptake inhibition of Noradrenaline (NA)
In DepthDetails ArticlePubMed
TargetD(2) dopamine receptor(Rattus norvegicus (rat))
H. Lundbeck
Curated by ChEMBL
LigandPNGBDBM50020240(1-[6-Fluoro-3-(4-fluoro-phenyl)-indan-1-yl]-4-meth...)
Affinity DataIC50:  410nM. Assay description: Binding affinity against dopamine receptor D2
In DepthDetails ArticlePubMed