BDBM50367221 CHEMBL3144022::CHEMBL604140
SMILES NC(=O)c1csc(n1)[C@@H]1O[C@H](COP(O)(O)=O)[C@@H](O)[C@H]1O
InChI Key InChIKey=XDDGVTBJYGSVPM-RKEPMNIXSA-N
Data  2 KI
  Tab Delimited (TSV)   2D SDfile   Computed 3D by Vconf -m prep SDfile
Find this compound or compounds like it in BindingDB:
Activity Spreadsheet -- Enzyme Inhibition Constant Data from BindingDB
Found 2 hits for monomerid = 50367221
TargetGlutamate dehydrogenase 1, mitochondrial(Bos taurus)
University Of Rochester Medical Center
Curated by ChEMBL
LigandPNGBDBM50367221(CHEMBL3144022 | CHEMBL604140)
Affinity DataKi:  6.52E+4nM. Assay description: In vitro inhibitory activity against bovine liver glutamate dehydrogenase (GDH)
In DepthDetails ArticlePubMed
TargetAlcohol dehydrogenase E/S chain(Equus caballus)
University Of Rochester Medical Center
Curated by ChEMBL
LigandPNGBDBM50367221(CHEMBL3144022 | CHEMBL604140)
Affinity DataKi:  1.05E+5nM. Assay description: In vitro inhibitory activity against horse liver Alcohol dehydrogenase
In DepthDetails ArticlePubMed