BDBM50019672 2-Isopropyl-11-oxo-11H-pyrido[2,1-b]quinazoline-8-carboxylic acid (3-pyridin-3-yl-propyl)-amide::CHEMBL1204213::CHEMBL60764
SMILES CC(C)c1ccc2nc3ccc(cn3c(=O)c2c1)C(=O)NCCCc1cccnc1
InChI Key InChIKey=UWGWIZYHHAEVAE-UHFFFAOYSA-N
Data  2 IC50
  Tab Delimited (TSV)   2D SDfile   Computed 3D by Vconf -m prep SDfile
Find this compound or compounds like it in BindingDB:
Activity Spreadsheet -- Enzyme Inhibition Constant Data from BindingDB
Found 2 hits for monomerid = 50019672
TargetThromboxane-A synthase(Homo sapiens (Human))
TBA
Curated by ChEMBL
LigandPNGBDBM50019672(2-Isopropyl-11-oxo-11H-pyrido[2,1-b]quinazoline-8-...)
Affinity DataIC50:  100nM. Assay description: Inhibition of human platelet thromboxane synthase (TXA2) was determined in human platelets
In DepthDetails ArticlePubMed
TargetPlatelet-activating factor receptor(Homo sapiens (Human))
Hoffmann-La Roche
Curated by ChEMBL
LigandPNGBDBM50019672(2-Isopropyl-11-oxo-11H-pyrido[2,1-b]quinazoline-8-...)
Affinity DataIC50: >1.00E+3nM. Assay description: Ability to inhibit platelet activating factor (PAF) binding to platelets by 50% was determined by using [3H]-PAF as radioligand
In DepthDetails ArticlePubMed