BDBM50367777 CHEMBL1202653
SMILES C(CCn1ccnc1)COc1ccc(cc1)-c1csc(n1)-c1ccccc1
InChI Key InChIKey=DYCYDQXGJWZSOH-UHFFFAOYSA-N
Data  2 IC50
  Tab Delimited (TSV)   2D SDfile   Computed 3D by Vconf -m prep SDfile
Find this compound or compounds like it in BindingDB:
Activity Spreadsheet -- Enzyme Inhibition Constant Data from BindingDB
Found 2 hits for monomerid = 50367777
TargetPotassium-transporting ATPase alpha chain 1/subunit beta(Homo sapiens (Human))
Ortho Pharmaceutical
Curated by ChEMBL
LigandPNGBDBM50367777(CHEMBL1202653)
Affinity DataIC50:  310nM. Assay description: Antisecretory activity evaluated by the inhibition of 14C -AP uptake in isolated rabbit parietal cells stimulated by dibutyryl cyclic adenosine 3', 5...
In DepthDetails ArticlePubMed
TargetPotassium-transporting ATPase alpha chain 1/subunit beta(Homo sapiens (Human))
Ortho Pharmaceutical
Curated by ChEMBL
LigandPNGBDBM50367777(CHEMBL1202653)
Affinity DataIC50:  820nM. Assay description: Antisecretory activity evaluated by the inhibition of 14C -AP uptake in isolated rabbit parietal cells stimulated by exogenous histamine
In DepthDetails ArticlePubMed