BDBM50367823 CHEMBL1907790
SMILES ONC(=O)[C@@H](Cc1ccccc1)NC(=O)CC(O)=O
InChI Key InChIKey=NZANRTNJFDQLKN-SECBINFHSA-N
Data  1 IC50
  Tab Delimited (TSV)   2D SDfile   Computed 3D by Vconf -m prep SDfile
Find this compound or compounds like it in BindingDB:
Activity Spreadsheet -- Enzyme Inhibition Constant Data from BindingDB
Found 1 hit for monomerid = 50367823
TargetNeprilysin(Oryctolagus cuniculus (rabbit))
Ua 498 Cnrs
Curated by ChEMBL
LigandPNGBDBM50367823(CHEMBL1907790)
Affinity DataIC50:  3.35E+3nM. Assay description: Inhibition of [3H]Ala2-Leu-enkephalin binding to Neutral endopeptidase (NEP)
In DepthDetails ArticlePubMed