BDBM50367894 CHEMBL604861
SMILES Nc1nc(NCC(c2ccccc2)c2ccccc2)c2ncn(C3O[C@H](CO)[C@@H](O)[C@H]3O)c2n1
InChI Key InChIKey=DWLRQCKPLTUZSI-PSBUXNCMSA-N
Data  1 KI
  Tab Delimited (TSV)   2D SDfile   Computed 3D by Vconf -m prep SDfile
Find this compound or compounds like it in BindingDB:
Activity Spreadsheet -- Enzyme Inhibition Constant Data from BindingDB
Found 1 hit for monomerid = 50367894
TargetAdenosine receptor A1(Rattus norvegicus (rat))
Warner-Lambert
Curated by ChEMBL
LigandPNGBDBM50367894(CHEMBL604861)
Affinity DataKi:  61nM. Assay description: Inhibition of binding of [3H]N6-cyclohexyladenosine to adenosine A1 receptor of rat whole brain membranes.Checked by Author
In DepthDetails ArticlePubMed