BDBM50368070 CHEMBL1907693
SMILES CCN1CCC[C@H]1CNC(=O)c1c(N)c(Br)cc(OC)c1OC
InChI Key InChIKey=JVZAYLSEXNKOFB-JTQLQIEISA-N
Data  1 IC50
  Tab Delimited (TSV)   2D SDfile   Computed 3D by Vconf -m prep SDfile
Find this compound or compounds like it in BindingDB:
Activity Spreadsheet -- Enzyme Inhibition Constant Data from BindingDB
Found 1 hit for monomerid = 50368070
TargetD(2) dopamine receptor(Rattus norvegicus (rat))
Astra Research Centre
Curated by ChEMBL
LigandPNGBDBM50368070(CHEMBL1907693)
Affinity DataIC50:  21nM. Assay description: In vitro ability to inhibit the binding of [3H]spiperone to dopamine receptor D2 in rat striatal membranes.
In DepthDetails ArticlePubMed