BDBM50368189 CHEMBL2235604::CHEMBL603926
SMILES OC[C@H]1O[C@H]([C@H](O)[C@@H]1O)n1cnc2c(NC3Cc4ccccc4C3)ncnc12
InChI Key InChIKey=NKTIWTYWGRTWOE-XAUNWSGPSA-N
Data  2 KI
  Tab Delimited (TSV)   2D SDfile   Computed 3D by Vconf -m prep SDfile
Find this compound or compounds like it in BindingDB:
Activity Spreadsheet -- Enzyme Inhibition Constant Data from BindingDB
Found 2 hits for monomerid = 50368189
TargetAdenosine receptor A1(Rattus norvegicus (rat))
Warner-Lambert
Curated by ChEMBL
LigandPNGBDBM50368189(CHEMBL2235604 | CHEMBL603926)
Affinity DataKi:  24nM. Assay description: Binding affinity towards adenosine A1 receptor
In DepthDetails ArticlePubMed
TargetAdenosine receptor A2a/A2b(Rattus norvegicus)
Warner-Lambert
Curated by ChEMBL
LigandPNGBDBM50368189(CHEMBL2235604 | CHEMBL603926)
Affinity DataKi:  1.64E+3nM. Assay description: Binding affinity towards adenosine A2 receptor
In DepthDetails ArticlePubMed