BDBM50368219 CHEMBL3350060::CHEMBL604351
SMILES OC[C@H]1O[C@H]([C@H](O)[C@@H]1O)n1cnc2c(NC3CCCc4ccccc34)ncnc12
InChI Key InChIKey=DXHLGWYQWDVEAA-XZTLXSFZSA-N
Data  2 KI
  Tab Delimited (TSV)   2D SDfile   Computed 3D by Vconf -m prep SDfile
Find this compound or compounds like it in BindingDB:
Activity Spreadsheet -- Enzyme Inhibition Constant Data from BindingDB
Found 2 hits for monomerid = 50368219
TargetAdenosine receptor A1(Rattus norvegicus (rat))
Warner-Lambert
Curated by ChEMBL
LigandPNGBDBM50368219(CHEMBL3350060 | CHEMBL604351)
Affinity DataKi:  34nM. Assay description: Binding affinity towards adenosine A1 receptor
In DepthDetails ArticlePubMed
TargetAdenosine receptor A2a/A2b(Rattus norvegicus)
Warner-Lambert
Curated by ChEMBL
LigandPNGBDBM50368219(CHEMBL3350060 | CHEMBL604351)
Affinity DataKi:  321nM. Assay description: Binding affinity towards adenosine A1 receptor
In DepthDetails ArticlePubMed