BDBM50368412 CHEMBL1790886
SMILES CC[C@@H](C)[C@H](NC(=O)[C@@H]1CCCN1C[C@@H](O)[C@H](Cc1ccccc1)NC(=O)[C@H](CC(N)=O)NC(=O)OCc1ccccc1)C(=O)N[C@@H](Cc1ccccc1)C(=O)OC
InChI Key InChIKey=QDSIURMOHBBWLV-JYCZPESISA-N
Data  1 IC50
  Tab Delimited (TSV)   2D SDfile   Computed 3D by Vconf -m prep SDfile
Find this compound or compounds like it in BindingDB:
Activity Spreadsheet -- Enzyme Inhibition Constant Data from BindingDB
Found 1 hit for monomerid = 50368412
TargetGag-Pol polyprotein [489-587](Human immunodeficiency virus type 1)
Washington University
Curated by ChEMBL
LigandPNGBDBM50368412(CHEMBL1790886)
Affinity DataIC50:  4nM. Assay description: Inhibitory potency against HIV-1 protease
In DepthDetails ArticlePubMed