BDBM50368474 CHEMBL608167
SMILES COc1ccccc1CN=Nc1nc(N)c2ncn(C3O[C@H](CO)[C@@H](O)[C@H]3O)c2n1
InChI Key InChIKey=PMFKANKMPZWXCP-IKYDMHQPSA-N
Data  1 EC50
  Tab Delimited (TSV)   2D SDfile   Computed 3D by Vconf -m prep SDfile
Find this compound or compounds like it in BindingDB:
Activity Spreadsheet -- Enzyme Inhibition Constant Data from BindingDB
Found 1 hit for monomerid = 50368474
TargetAdenosine receptor A1(GUINEA PIG)
University Of South Florida
Curated by ChEMBL
LigandPNGBDBM50368474(CHEMBL608167)
Affinity DataEC50:  1.23E+4nM. Assay description: Tested for adenosine A1 receptor agonistic activity by determining concentration needed to prolong the stimulus-QRS interval by 50% of the maximum re...Checked by Author
In DepthDetails ArticlePubMed