BDBM50368526 CHEMBL1202026
SMILES Fc1ccc(cc1)C(=O)C1CCN(CCNC(=O)c2ccccc2)CC1
InChI Key InChIKey=PFTMYQJEHXGQGU-UHFFFAOYSA-N
Data  2 KI
  Tab Delimited (TSV)   2D SDfile   Computed 3D by Vconf -m prep SDfile
Find this compound or compounds like it in BindingDB:
Activity Spreadsheet -- Enzyme Inhibition Constant Data from BindingDB
Found 2 hits for monomerid = 50368526
TargetSerotonin 2 (5-HT2) receptor(RAT)
Virginia Commonwealth University
Curated by ChEMBL
LigandPNGBDBM50368526(CHEMBL1202026)
Affinity DataKi:  16nM. Assay description: Binding affinity against 5-hydroxytryptamine 2 receptor in rat using [3H]ketanserin as radioligand
In DepthDetails ArticlePubMed
Target5-hydroxytryptamine receptor 2C(Rattus norvegicus (Rat))
Virginia Commonwealth University
Curated by ChEMBL
LigandPNGBDBM50368526(CHEMBL1202026)
Affinity DataKi:  1.61E+3nM. Assay description: Binding affinity against 5-hydroxytryptamine 1C receptor in rat using [3H]mesulergine as radioligand
In DepthDetails ArticlePubMed