BDBM50368577 CHEMBL604242
SMILES OC[C@H]1OC([C@H](O)[C@@H]1O)n1cnc2c(NCC3CC3)ncnc12
InChI Key InChIKey=LLDGSWFLUWHPQB-OYBGHCQBSA-N
Data  1 KI
  Tab Delimited (TSV)   2D SDfile   Computed 3D by Vconf -m prep SDfile
Find this compound or compounds like it in BindingDB:
Activity Spreadsheet -- Enzyme Inhibition Constant Data from BindingDB
Found 1 hit for monomerid = 50368577
TargetAdenosine receptor A1(GUINEA PIG)
Kyowa Hakko Kogyo
Curated by ChEMBL
LigandPNGBDBM50368577(CHEMBL604242)
Affinity DataKi:  0.75nM. Assay description: Binding affinity against adenosine A1 receptor using N6-[3H]cyclohexyladenosine as radioligand in guinea pig forebrain membranes
In DepthDetails ArticlePubMed