BDBM50368591 CHEMBL1794795
SMILES CCCN(CCC)C1CN2C(=O)COc3cccc(C1)c23
InChI Key InChIKey=HTTOQWRXSYPSPD-UHFFFAOYSA-N
Data  2 KI
  Tab Delimited (TSV)   2D SDfile   Computed 3D by Vconf -m prep SDfile
Find this compound or compounds like it in BindingDB:
Activity Spreadsheet -- Enzyme Inhibition Constant Data from BindingDB
Found 2 hits for monomerid = 50368591
Target5-hydroxytryptamine receptor 1A(Homo sapiens (Human))
Upjohn Laboratories
Curated by ChEMBL
LigandPNGBDBM50368591(CHEMBL1794795)
Affinity DataKi:  12nM. Assay description: Ability to displace [3H]-DPAT from 5-hydroxytryptamine 1A receptor in homogenates of bovine hippocampus.
In DepthDetails ArticlePubMed
TargetD(2) dopamine receptor(Rattus norvegicus (rat))
Upjohn Laboratories
Curated by ChEMBL
LigandPNGBDBM50368591(CHEMBL1794795)
Affinity DataKi:  1.35E+3nM. Assay description: Ability to displace [3H]raclopride from dopamine receptor D2 in rat striatal homogenates.
In DepthDetails ArticlePubMed