BDBM50368665 CHEMBL1744122
SMILES CC(C)N1CCN(CCN2CCN(CC2)C2CC(c3cc(Br)ccc23)c2ccc(F)cc2)C1=O
InChI Key InChIKey=JOAAFQMXBGOANP-UHFFFAOYSA-N
Data  3 IC50
  Tab Delimited (TSV)   2D SDfile   Computed 3D by Vconf -m prep SDfile
Find this compound or compounds like it in BindingDB:
Activity Spreadsheet -- Enzyme Inhibition Constant Data from BindingDB
Found 3 hits for monomerid = 50368665
TargetD(2) dopamine receptor(Rattus norvegicus (rat))
H. Lundbeck
Curated by ChEMBL
LigandPNGBDBM50368665(CHEMBL1744122)
Affinity DataIC50:  240nM. Assay description: Displacement of [3H]spiperone from dopamine D2 receptors in rat striatal membranes
In DepthDetails ArticlePubMed
TargetAlpha-1A/Alpha-1B/Alpha-1D adrenergic receptor(Rattus norvegicus (rat))
H. Lundbeck
Curated by ChEMBL
LigandPNGBDBM50368665(CHEMBL1744122)
Affinity DataIC50:  270nM. Assay description: Displacement of [3H]prazosin from alpha-1 adrenoceptors in whole rat brain membranes
In DepthDetails ArticlePubMed
TargetSerotonin 2 (5-HT2) receptor(RAT)
H. Lundbeck
Curated by ChEMBL
LigandPNGBDBM50368665(CHEMBL1744122)
Affinity DataIC50:  6.40nM. Assay description: Displacement of [3H]ketanserin from 5-hydroxytryptamine 2 receptor in rat cortical membranes
In DepthDetails ArticlePubMed