BDBM50368853 CHEMBL1743629
SMILES COc1cccc2CC3CN(CCCCN4C(=O)C5C(C6C=CC5C5C=CC65)C4=O)CCC3c12
InChI Key InChIKey=JFLJSOJGVKQKJH-UHFFFAOYSA-N
Data  2 KI
  Tab Delimited (TSV)   2D SDfile   Computed 3D by Vconf -m prep SDfile
Find this compound or compounds like it in BindingDB:
Activity Spreadsheet -- Enzyme Inhibition Constant Data from BindingDB
Found 2 hits for monomerid = 50368853
Target5-hydroxytryptamine receptor 1A(Rattus norvegicus (rat))
Abbott Laboratories
Curated by ChEMBL
LigandPNGBDBM50368853(CHEMBL1743629)
Affinity DataKi:  3.60nM. Assay description: Binding affinity for 5-hydroxytryptamine 1A receptor with [3H]5-HT
In DepthDetails ArticlePubMed
Target5-hydroxytryptamine receptor 1B(Rattus norvegicus (Rat))
Abbott Laboratories
Curated by ChEMBL
LigandPNGBDBM50368853(CHEMBL1743629)
Affinity DataKi:  1.31E+3nM. Assay description: Inhibition of [3H]5-HT binding to 5-hydroxytryptamine 1B receptor
In DepthDetails ArticlePubMed