BDBM50368941 CHEMBL608369
SMILES O[C@H]1[C@@H](O)C(O[C@@H]1C(=O)NC1CC1)n1cnc2c(NCCc3cn(Cc4ccc(Cl)c(Cl)c4)c4ccccc34)ncnc12
InChI Key InChIKey=BXZFTIVBTPYHQM-FUFUOGOSSA-N
Data  1 KI
  Tab Delimited (TSV)   2D SDfile   Computed 3D by Vconf -m prep SDfile
Find this compound or compounds like it in BindingDB:
Activity Spreadsheet -- Enzyme Inhibition Constant Data from BindingDB
Found 1 hit for monomerid = 50368941
TargetAdenosine receptor A1(Rattus norvegicus (rat))
Carpibem
Curated by ChEMBL
LigandPNGBDBM50368941(CHEMBL608369)
Affinity DataKi:  140nM. Assay description: Binding affinity for adenosine A1 receptor in vitro using rat brain membranes.
In DepthDetails ArticlePubMed