BDBM50368981 CHEMBL4168671
SMILES COc1cc(ccc1Nc1nc(N)c(s1)C(=O)c1ccc(NC(=O)C=C)cc1)N1CCN(C)CC1
InChI Key InChIKey=VYWMWKFIDRIEPP-UHFFFAOYSA-N
Data  1 KI  1 IC50
  Tab Delimited (TSV)   2D SDfile   Computed 3D by Vconf -m prep SDfile
Find this compound or compounds like it in BindingDB:
Activity Spreadsheet -- Enzyme Inhibition Constant Data from BindingDB
Found 2 hits for monomerid = 50368981
TargetDual specificity tyrosine-phosphorylation-regulated kinase 1A(Homo sapiens (Human))
Uit The Arctic University Of Norway
Curated by ChEMBL
LigandPNGBDBM50368981(CHEMBL4168671)
Affinity DataKi:  575nM. Assay description: Inhibition of DYRK1A (unknown origin) using DYRKtide as substrate by ATP regenerative NADH consuming assay
In DepthDetails ArticlePubMed
TargetDual specificity tyrosine-phosphorylation-regulated kinase 1A(Homo sapiens (Human))
Uit The Arctic University Of Norway
Curated by ChEMBL
LigandPNGBDBM50368981(CHEMBL4168671)
Affinity DataIC50:  1.20E+3nM. Assay description: Inhibition of DYRK1A (unknown origin) using DYRKtide as substrate by ATP regenerative NADH consuming assay
In DepthDetails ArticlePubMed