BDBM50369369 CHEMBL1790759
SMILES CC[C@@H](C)[C@@H](CN(CC(=O)N[C@@H](CCSC)C(O)=O)Cc1ccccc1)NC(=O)CCS
InChI Key InChIKey=LHBPAVBXBGRAKB-YZGWKJHDSA-N
Data  1 IC50
  Tab Delimited (TSV)   2D SDfile   Computed 3D by Vconf -m prep SDfile
Find this compound or compounds like it in BindingDB:
Activity Spreadsheet -- Enzyme Inhibition Constant Data from BindingDB
Found 1 hit for monomerid = 50369369
TargetProtein farnesyltransferase subunit beta/geranylgeranyltransferase type-1 subunit alpha(Homo sapiens (Human))
Merck Research Laboratories
Curated by ChEMBL
LigandPNGBDBM50369369(CHEMBL1790759)
Affinity DataIC50:  110nM. Assay description: Inhibition of [3H]-FPP incorporation into recombinant human Ha-Ras by Farnesyltransferase
In DepthDetails ArticlePubMed