BDBM50369386 CHEMBL608327
SMILES CNC(=O)[C@H]1OC([C@H](O)[C@@H]1O)n1cnc2c(NCc3cccc(I)c3Cl)ncnc12
InChI Key InChIKey=AJASMUGOIFKXOZ-CDJKEZFESA-N
Data  3 KI
  Tab Delimited (TSV)   2D SDfile   Computed 3D by Vconf -m prep SDfile
Find this compound or compounds like it in BindingDB:
Activity Spreadsheet -- Enzyme Inhibition Constant Data from BindingDB
Found 3 hits for monomerid = 50369386
TargetAdenosine receptor A3(Rattus norvegicus)
Universit£
Curated by ChEMBL
LigandPNGBDBM50369386(CHEMBL608327)
Affinity DataKi:  0.330nM. Assay description: Binding affinity against rat adenosine A3 receptor expressed in CHO cells using [125I]-.
In DepthDetails ArticlePubMed
TargetAdenosine receptor A2a(Rattus norvegicus (rat))
Universit£
Curated by ChEMBL
LigandPNGBDBM50369386(CHEMBL608327)
Affinity DataKi:  470nM. Assay description: Binding affinity against adenosine A2A receptor in rat striatal membranes using [3H]-CGS- 21680.
In DepthDetails ArticlePubMed
TargetAdenosine receptor A1(Rattus norvegicus (rat))
Universit£
Curated by ChEMBL
LigandPNGBDBM50369386(CHEMBL608327)
Affinity DataKi:  820nM. Assay description: Binding affinity against adenosine A1 receptor in rat brain membranes using [3H]R-PIA.
In DepthDetails ArticlePubMed