BDBM50369460 CHEMBL1788109
SMILES C[C@@H](SC(C)=O)C(=O)N1[C@@H](C[C@@H]([C@@H]1c1ccccc1)C(O)=O)C(O)=O
InChI Key InChIKey=XKCYVTMXMZFYCR-HYNSBDGHSA-N
Data  1 KI
  Tab Delimited (TSV)   2D SDfile   Computed 3D by Vconf -m prep SDfile
Find this compound or compounds like it in BindingDB:
Activity Spreadsheet -- Enzyme Inhibition Constant Data from BindingDB
Found 1 hit for monomerid = 50369460
TargetAngiotensin-converting enzyme(Homo sapiens (Human))
Torrey Pines Institute For Molecular Studies
Curated by ChEMBL
LigandPNGBDBM50369460(CHEMBL1788109)
Affinity DataKi:  0.160nM. Assay description: Enzyme inhibitory activity towards Angiotensin I converting enzyme
In DepthDetails ArticlePubMed