BDBM50369484 CYNARIN
SMILES O[C@@H]1C[C@](C[C@@H](OC(=O)\C=C\c2ccc(O)c(O)c2)[C@H]1O)(OC(=O)\C=C\c1ccc(O)c(O)c1)C(O)=O
InChI Key InChIKey=YDDUMTOHNYZQPO-RVXRWRFUSA-N
Data  1 IC50
  Tab Delimited (TSV)   2D SDfile   Computed 3D by Vconf -m prep SDfile
Find this compound or compounds like it in BindingDB:
Activity Spreadsheet -- Enzyme Inhibition Constant Data from BindingDB
Found 1 hit for monomerid = 50369484
TargetIntegrase(Human immunodeficiency virus 1)
University Of California
Curated by ChEMBL
LigandPNGBDBM50369484(CYNARIN)
Affinity DataIC50:  1.60E+3nM. Assay description: Inhibitory activity against Human Immunodeficiency Virus Type 1 integrase (HIV-1 IN) in the disintegration assay.
In DepthDetails ArticlePubMed