BDBM50369512 CHEMBL605054
SMILES CNC(=O)C[C@H]1OC([C@@H](O)[C@H]1O)n1cnc2c(NCc3cccc(I)c3)ncnc12
InChI Key InChIKey=SCMZRPGHDUTPBP-HWQOSGRBSA-N
Data  1 KI
  Tab Delimited (TSV)   2D SDfile   Computed 3D by Vconf -m prep SDfile
Find this compound or compounds like it in BindingDB:
Activity Spreadsheet -- Enzyme Inhibition Constant Data from BindingDB
Found 1 hit for monomerid = 50369512
TargetAdenosine receptor A3(Homo sapiens (Human))
Leiden/Amsterdam Center For Drug Research
Curated by ChEMBL
LigandPNGBDBM50369512(CHEMBL605054)
Affinity DataKi:  1.10nM. Assay description: Displacement of [125I]AB-MECA from human Adenosine A3 receptor expressed in HEK 293 cells
In DepthDetails ArticlePubMed