BDBM50369521 CHEMBL610939
SMILES CC(C)(C)CSc1nc2c(N)ncnc2n1C1O[C@H](COP(O)(=O)OP(O)(=O)OP(O)(O)=O)[C@@H](O)[C@H]1O
InChI Key InChIKey=BRTIBYXSCNUYAI-RJNFYWFKSA-N
Data  1 KI
  Tab Delimited (TSV)   2D SDfile   Computed 3D by Vconf -m prep SDfile
Find this compound or compounds like it in BindingDB:
Activity Spreadsheet -- Enzyme Inhibition Constant Data from BindingDB
Found 1 hit for monomerid = 50369521
TargetEctonucleoside triphosphate diphosphohydrolase 1(Bos taurus)
Universit£
Curated by ChEMBL
LigandPNGBDBM50369521(CHEMBL610939)
Affinity DataKi:  4.50E+4nM. Assay description: Tested for inhibition of Nucleoside Triphosphate Diphosphohydrolase (NTPDase) from bovine spleen.
In DepthDetails ArticlePubMed