BDBM50369562 CHEMBL1790698
SMILES CC[C@H](C)[C@@H]1NC(=O)[C@@H]2CCCN2C(=O)[C@H](Cc2ccccc2)N(C)C(=O)[C@H](Cc2ccccc2)NC(=O)[C@H](C(C)C)N(C)C(=O)[C@H](OC(=O)[C@@H](N(C)C(=O)[C@H](CC(C)C)NC(=O)C(OC1=O)C(C)C)C(C)(C)O)[C@@H](C)CC
InChI Key InChIKey=NBMYNKIXYQMJCL-NDXMGTNASA-N
Data  1 IC50
  Tab Delimited (TSV)   2D SDfile   Computed 3D by Vconf -m prep SDfile
Find this compound or compounds like it in BindingDB:
Activity Spreadsheet -- Enzyme Inhibition Constant Data from BindingDB
Found 1 hit for monomerid = 50369562
TargetATP-dependent translocase ABCB1(Homo sapiens (Human))
Strasbourg 1 University
Curated by ChEMBL
LigandPNGBDBM50369562(CHEMBL1790698)
Affinity DataIC50:  1.66E+3nM. Assay description: Human MDR1 Pgp inhibitory activity by using standard calcein-AM efflux method with the human leukemia CEM cells.
In DepthDetails ArticlePubMed