BDBM50369786 CHEMBL1201889
SMILES Oc1ccc(cc1)C1CCN(CCOCc2ccccc2)CC1
InChI Key InChIKey=ILLLGSILPMXBCV-UHFFFAOYSA-N
Data  3 IC50
  Tab Delimited (TSV)   2D SDfile   Computed 3D by Vconf -m prep SDfile
Find this compound or compounds like it in BindingDB:
Activity Spreadsheet -- Enzyme Inhibition Constant Data from BindingDB
Found 3 hits for monomerid = 50369786
TargetGlutamate receptor ionotropic, NMDA 1/2B(Rattus norvegicus (Rat))
Cocensys
Curated by ChEMBL
LigandPNGBDBM50369786(CHEMBL1201889)
Affinity DataIC50:  19nM. Assay description: Inhibitory activity against Xenopus oocytes expressing rat N-Methyl-D-aspartate (NR1A/2B) Receptor subtype.
In DepthDetails ArticlePubMed
TargetGlutamate receptor ionotropic, NMDA 1/2A(Rattus norvegicus (Rat))
Cocensys
Curated by ChEMBL
LigandPNGBDBM50369786(CHEMBL1201889)
Affinity DataIC50:  5.90E+4nM. Assay description: Inhibitory activity against Xenopus oocytes expressing rat N-Methyl-D-aspartate (NR1A/2A) Receptor subtype.
In DepthDetails ArticlePubMed
LigandPNGBDBM50369786(CHEMBL1201889)
Affinity DataIC50: >1.00E+5nM. Assay description: Inhibitory activity against Xenopus oocytes expressing rat N-Methyl-D-aspartate (NR1A/2C) Receptor subtype.
In DepthDetails ArticlePubMed