BDBM50370073 CHEMBL1790421
SMILES CC[C@@H](C)[C@H](NC(=O)[C@H](CCSC)NC(=O)[C@H](CO)NC(=O)[C@H](CC1CCCCC1)NC[C@H](Cc1ccccc1)NC(=O)[C@H](CC1CCCCC1)NC(=O)[C@H](CO)NC(=O)[C@@H](N)CC(O)=O)C(O)=O
InChI Key InChIKey=IHLRWXZLKGMTJB-UOLIYBITSA-N
Data  1 KI
  Tab Delimited (TSV)   2D SDfile   Computed 3D by Vconf -m prep SDfile
Find this compound or compounds like it in BindingDB:
Activity Spreadsheet -- Enzyme Inhibition Constant Data from BindingDB
Found 1 hit for monomerid = 50370073
TargetGenome polyprotein(Human rhinovirus B)
Carlsberg Laboratory
Curated by ChEMBL
LigandPNGBDBM50370073(CHEMBL1790421)
Affinity DataKi:  1.01E+4nM. Assay description: Inhibition of Leishmania mexicana Cysteine protease B (CPB2.8deltaCTE) was obtained in a solution-phase assay
In DepthDetails ArticlePubMed