BDBM50370091 CHEMBL82831
SMILES Cc1c(F)c(Oc2cccc(Nc3ccccc3)c2)nc(Oc2cccc(c2)C(N)=N)c1F
InChI Key InChIKey=IXHICQQVOWCMCZ-UHFFFAOYSA-N
Data  3 KI
  Tab Delimited (TSV)   2D SDfile   Computed 3D by Vconf -m prep SDfile
Find this compound or compounds like it in BindingDB:
Activity Spreadsheet -- Enzyme Inhibition Constant Data from BindingDB
Found 3 hits for monomerid = 50370091
TargetCoagulation factor X(Homo sapiens (Human))
Berlex Biosciences
Curated by ChEMBL
LigandPNGBDBM50370091(CHEMBL82831)
Affinity DataKi:  1.80E+3nM. Assay description: Inhibitory constant against human coagulation factor Xa (fXa)
In DepthDetails ArticlePubMed
TargetProthrombin(Homo sapiens (Human))
Berlex Biosciences
Curated by ChEMBL
LigandPNGBDBM50370091(CHEMBL82831)
Affinity DataKi:  3.80E+3nM. Assay description: Inhibitory constant against human coagulation factor II (thrombin) for selectivity within coagulation cascade
In DepthDetails ArticlePubMed
TargetSerine protease 1(Homo sapiens (Human))
Berlex Biosciences
Curated by ChEMBL
LigandPNGBDBM50370091(CHEMBL82831)
Affinity DataKi: >5.00E+3nM. Assay description: Inhibitory constant against bovine trypsin for general specificity against serine proteases
In DepthDetails ArticlePubMed