BDBM50370344 CHEMBL1790815
SMILES CC[C@@H](C)[C@H](NC(=O)C[C@H](NC(=O)[C@H](CCC(O)=O)NC(=O)[C@H](Cc1ccc(OP(O)(O)=O)cc1)NC(C)=O)C(O)=O)C(O)=O
InChI Key InChIKey=NENDUAQWIARAPR-AMQQXSHDSA-N
Data  1 IC50
  Tab Delimited (TSV)   2D SDfile   Computed 3D by Vconf -m prep SDfile
Find this compound or compounds like it in BindingDB:
Activity Spreadsheet -- Enzyme Inhibition Constant Data from BindingDB
Found 1 hit for monomerid = 50370344
TargetProto-oncogene tyrosine-protein kinase Src(Homo sapiens (Human))
University Of Rhode Island
Curated by ChEMBL
LigandPNGBDBM50370344(CHEMBL1790815)
Affinity DataIC50:  9.07E+4nM. Assay description: Concentration of compoound required for inhibiting the binding of the fluorescent probe to the c-Src tyrosine kinase SH2 domain by 50%
In DepthDetails ArticlePubMed