BDBM50370346 CHEMBL1790812
SMILES CC[C@@H](C)[C@H](NC(=O)[C@H](CCC(O)=O)NC(=O)CC[C@H](NC(=O)[C@@H](N)Cc1ccc(OP(O)(O)=O)cc1)C(O)=O)C(O)=O
InChI Key InChIKey=CGHRFRRGSHXTOG-BEACGEKWSA-N
Data  1 IC50
  Tab Delimited (TSV)   2D SDfile   Computed 3D by Vconf -m prep SDfile
Find this compound or compounds like it in BindingDB:
Activity Spreadsheet -- Enzyme Inhibition Constant Data from BindingDB
Found 1 hit for monomerid = 50370346
TargetProto-oncogene tyrosine-protein kinase Src(Homo sapiens (Human))
University Of Rhode Island
Curated by ChEMBL
LigandPNGBDBM50370346(CHEMBL1790812)
Affinity DataIC50: >1.00E+5nM. Assay description: Concentration of compoound required for inhibiting the binding of the fluorescent probe to the c-Src tyrosine kinase SH2 domain by 50%
In DepthDetails ArticlePubMed